Target
Cathepsin D
Ligand
BDBM50030747
Substrate
Meas. Tech.
ChEMBL_1437721 (CHEMBL3382368)
Ki
0.011000±n/a nM
Citation
 Schmitz, JBeckmann, AMDudic, ALi, TSellier, RBartz, UGütschow, M 3-Cyano-3-aza-ß-amino Acid Derivatives as Inhibitors of Human Cysteine Cathepsins. ACS Med Chem Lett 5:1076-81 (2014)  
Target
Name:
Cathepsin D
Synonyms:
CATD_HUMAN CTSD Cathepsin D heavy chain Cathepsin D precursor
Type:
Enzyme
Mol. Mass.:
44551.72
Organism:
Homo sapiens (Human)
Description:
Human proCathepsin D (SwissProt accession number P07339) was expressed in Sf9 cells, purified, and autoactivated.
Residue:
412
  
Inhibitor
Name:
BDBM50030747
Synonyms:
CHEMBL3342183
Type:
Small organic molecule
Emp. Form.:
C12H20N4O4
Mol. Mass.:
284.3116
SMILES:
CC(C)(C)OC(=O)NN(CC(=O)N1CCOCC1)C#N
: