Target
Carbonic anhydrase 13
Ligand
BDBM50031588
Substrate
Meas. Tech.
ChEMBL_1441653 (CHEMBL3377630)
Kd
42±n/a nM
Target
Name:
Carbonic anhydrase 13
Synonyms:
CA13 Carbonic anhydrase Carbonic anhydrase XIII (CA XIII)
Type:
Enzyme
Mol. Mass.:
29445.78
Organism:
Homo sapiens (Human)
Description:
Q8N1Q1
Residue:
262
  
Inhibitor
Name:
BDBM50031588
Synonyms:
CHEMBL3359181
Type:
Small organic molecule
Emp. Form.:
C16H23F3N2O5S2
Mol. Mass.:
444.489
SMILES:
NS(=O)(=O)c1c(F)c(F)c(c(NC2CCCCCCC2)c1F)S(=O)(=O)CCO
: