Target
Carbonic anhydrase 12
Ligand
BDBM50031588
Substrate
Meas. Tech.
ChEMBL_1441658 (CHEMBL3377635)
Kd
<10.0±n/a nM
Target
Name:
Carbonic anhydrase 12
Synonyms:
CA-XII CAH12_HUMAN Carbonic anhydrase Carbonic anhydrase XII Carbonic anhydrase XII (CAXII) | Tumor antigen HOM-RCC-3.1.3
Type:
Enzyme
Mol. Mass.:
39456.00
Organism:
Homo sapiens (Human)
Description:
Catalytic domain of human cloned isozyme was used in the assay
Residue:
354
  
Inhibitor
Name:
BDBM50031588
Synonyms:
CHEMBL3359181
Type:
Small organic molecule
Emp. Form.:
C16H23F3N2O5S2
Mol. Mass.:
444.489
SMILES:
NS(=O)(=O)c1c(F)c(F)c(c(NC2CCCCCCC2)c1F)S(=O)(=O)CCO
: