Target
Tyrosine-protein phosphatase non-receptor type 22
Ligand
BDBM50031909
Substrate
Meas. Tech.
ChEMBL_1437898 (CHEMBL3384862)
Ki
19170±n/a nM
Citation
 Hou, XLi, RLi, KYu, XSun, JPFang, H Fast identification of novel lymphoid tyrosine phosphatase inhibitors using target-ligand interaction-based virtual screening. J Med Chem 57:9309-22 (2014)  
Target
Name:
Tyrosine-protein phosphatase non-receptor type 22
Synonyms:
3.1.3.48 LyP Lymphoid phosphatase (Lyp) PEST-domain phosphatase PTPN22 Tyrosine-protein phosphatase non-receptor type 22 (LYP) | tyrosine-protein phosphatase non-receptor type 22 isoform 1
Type:
Mol. Mass.:
91712.31
Organism:
Homo sapiens (Human)
Description:
Q9Y2R2
Residue:
807
  
Inhibitor
Name:
BDBM50031909
Synonyms:
CHEMBL3360907
Type:
Small organic molecule
Emp. Form.:
C26H16ClNO4
Mol. Mass.:
441.863
SMILES:
Cc1c(Cl)cccc1-c1ccc(o1)C(=O)Nc1ccc2C(=O)c3ccccc3C(=O)c2c1
: