Target
4-galactosyl-N-acetylglucosaminide 3-alpha-L-fucosyltransferase 9
Ligand
BDBM50035294
Substrate
Meas. Tech.
ChEMBL_1432745 (CHEMBL3390549)
Ki
190000±n/a nM
Citation
 Seelhorst, KPiernitzki, TLunau, NMeier, CHahn, U Synthesis and analysis of potentiala1,3-fucosyltransferase inhibitors. Bioorg Med Chem 22:6430-7 (2014)  
Target
Name:
4-galactosyl-N-acetylglucosaminide 3-alpha-L-fucosyltransferase 9
Synonyms:
Alpha-(1,3)-fucosyltransferase 9 FUT9_HUMAN FucT-IX Fucosyltransferase IX | Galactoside 3-L-fucosyltransferase
Type:
PROTEIN
Mol. Mass.:
42078.14
Organism:
Homo sapiens (Human)
Description:
ChEMBL_10775
Residue:
359
  
Inhibitor
Name:
BDBM50035294
Synonyms:
CHEMBL3343358
Type:
Small organic molecule
Emp. Form.:
C19H27N8NaO15P2
Mol. Mass.:
692.3996
SMILES:
[Na+].C[C@H]1O[C@H]([C@H](O)[C@@H](O)[C@H]1O)n1cc(COP(O)(=O)OP([O-])(=O)OC[C@H]2O[C@H]([C@H](O)[C@@H]2O)n2cnc3c2nc(N)[nH]c3=O)nn1
: