Target
4-galactosyl-N-acetylglucosaminide 3-alpha-L-fucosyltransferase 9
Ligand
BDBM50035297
Substrate
Meas. Tech.
ChEMBL_1432745 (CHEMBL3390549)
Ki
50300±n/a nM
Citation
 Seelhorst, KPiernitzki, TLunau, NMeier, CHahn, U Synthesis and analysis of potentiala1,3-fucosyltransferase inhibitors. Bioorg Med Chem 22:6430-7 (2014)  
Target
Name:
4-galactosyl-N-acetylglucosaminide 3-alpha-L-fucosyltransferase 9
Synonyms:
Alpha-(1,3)-fucosyltransferase 9 FUT9_HUMAN FucT-IX Fucosyltransferase IX | Galactoside 3-L-fucosyltransferase
Type:
PROTEIN
Mol. Mass.:
42078.14
Organism:
Homo sapiens (Human)
Description:
ChEMBL_10775
Residue:
359
  
Inhibitor
Name:
BDBM50035297
Synonyms:
CHEBI:28862 | CHEMBL1232205
Type:
Small organic molecule
Emp. Form.:
C10H15N5O10P2
Mol. Mass.:
427.2011
SMILES:
Nc1nc2n(cnc2c(=O)[nH]1)[C@H]1C[C@H](O)[C@@H](CO[P@@](O)(=O)OP(O)(O)=O)O1
: