Target
Kinesin-like protein KIFC1
Ligand
BDBM50037960
Substrate
Meas. Tech.
ChEMBL_1438848 (CHEMBL3390316)
IC50
4500±n/a nM
Citation
 Yang, BLamb, MLZhang, THennessy, EJGrewal, GSha, LZambrowski, MBlock, MHDowling, JESu, NWu, JDeegan, TMikule, KWang, WKaspera, RChuaqui, CChen, H Discovery of potent KIFC1 inhibitors using a method of integrated high-throughput synthesis and screening. J Med Chem 57:9958-70 (2014)  
Target
Name:
Kinesin-like protein KIFC1
Synonyms:
HSET KIFC1 KNSL2 Kinesin-like protein KIFC1 | Kinesin-related protein HSET
Type:
PROTEIN
Mol. Mass.:
73763.89
Organism:
Homo sapiens (Human)
Description:
ChEMBL_109524
Residue:
673
  
Inhibitor
Name:
BDBM50037960
Synonyms:
CHEMBL3358277
Type:
Small organic molecule
Emp. Form.:
C29H34F3N3O2S
Mol. Mass.:
545.659
SMILES:
CCCc1cc(sc1C)C(=O)N[C@@H](Cc1ccc(cc1)-c1cccc(c1)C(F)(F)F)C(=O)NCCN(C)C
: