Target
Nucleotide-binding oligomerization domain-containing protein 2
Ligand
BDBM62257
Substrate
Meas. Tech.
ChEMBL_1450779 (CHEMBL3363924)
IC50
390±n/a nM
Citation
 Jakopin, ? Nucleotide-binding oligomerization domain (NOD) inhibitors: a rational approach toward inhibition of NOD signaling pathway. J Med Chem 57:6897-918 (2014)  
Target
Name:
Nucleotide-binding oligomerization domain-containing protein 2
Synonyms:
CARD15 IBD1 NOD2 Nucleotide-binding oligomerization domain-containing protein 2 | nucleotide-binding oligomerization domain containing 2
Type:
PROTEIN
Mol. Mass.:
115287.18
Organism:
Homo sapiens (Human)
Description:
ChEMBL_1454053
Residue:
1040
  
Inhibitor
Name:
BDBM62257
Synonyms:
MLS-0360553.0001 cyclopropyl-[5-[4-(4-methoxyphenyl)piperazin-1-yl]sulfonyl-2-methyl-2,3-dihydroindol-1-yl]methanone cyclopropyl-[5-[[4-(4-methoxyphenyl)-1-piperazinyl]sulfonyl]-2-methyl-2,3-dihydroindol-1-yl]methanone
Type:
Small organic molecule
Emp. Form.:
C24H29N3O4S
Mol. Mass.:
455.57
SMILES:
COc1ccc(cc1)N1CCN(CC1)S(=O)(=O)c1ccc2N(C(C)Cc2c1)C(=O)C1CC1
: