Target
Nucleotide-binding oligomerization domain-containing protein 2
Ligand
BDBM62334
Substrate
Meas. Tech.
ChEMBL_1450779 (CHEMBL3363924)
IC50
11900±n/a nM
Citation
 Jakopin, ? Nucleotide-binding oligomerization domain (NOD) inhibitors: a rational approach toward inhibition of NOD signaling pathway. J Med Chem 57:6897-918 (2014)  
Target
Name:
Nucleotide-binding oligomerization domain-containing protein 2
Synonyms:
CARD15 IBD1 NOD2 Nucleotide-binding oligomerization domain-containing protein 2 | nucleotide-binding oligomerization domain containing 2
Type:
PROTEIN
Mol. Mass.:
115287.18
Organism:
Homo sapiens (Human)
Description:
ChEMBL_1454053
Residue:
1040
  
Inhibitor
Name:
BDBM62334
Synonyms:
1-[(4-chlorophenyl)methyl]-2-benzimidazolamine MLS-0425658.0001 cid_743900
Type:
Small organic molecule
Emp. Form.:
C14H12ClN3
Mol. Mass.:
257.718
SMILES:
Nc1nc2ccccc2n1Cc1ccc(Cl)cc1
: