Target
Lysosomal alpha-glucosidase
Ligand
BDBM50242271
Substrate
Meas. Tech.
ChEMBL_1453753 (CHEMBL3364468)
IC50
1300±n/a nM
Citation
 Natori, YSakuma, TYoshimura, YKinami, KHirokami, YSato, KAdachi, IKato, ATakahata, H Synthesis and biological evaluation ofa-1-C-4'-arylbutyl-L-arabinoiminofuranoses, a new class ofa-glucosidase inhibitors. Bioorg Med Chem Lett 24:3298-301 (2014)  
Target
Name:
Lysosomal alpha-glucosidase
Synonyms:
Acidic alpha-glucosidase LYAG_RAT
Type:
PROTEIN
Mol. Mass.:
106191.24
Organism:
Rattus norvegicus
Description:
ChEMBL_1506157
Residue:
953
  
Inhibitor
Name:
BDBM50242271
Synonyms:
(2R,3R,4R,5S)-1-(2-hydroxyethyl)-2-(hydroxymethyl)piperidine-3,4,5-triol BAY-M-1099 Glyset N-Hydroxyethyl-1-deoxynojirimycin | cid_441314
Type:
Small organic molecule
Emp. Form.:
C8H17NO5
Mol. Mass.:
207.2243
SMILES:
OCCN1C[C@H](O)[C@@H](O)[C@H](O)[C@H]1CO
: