Target
Diacylglycerol lipase-alpha
Ligand
BDBM50048620
Substrate
Meas. Tech.
ChEMBL_1449471 (CHEMBL3373887)
Ki
700±n/a nM
Citation
 Janssen, FJDeng, HBaggelaar, MPAllarà, Mvan der Wel, Tden Dulk, HLigresti, Avan Esbroeck, ACMcGuire, RDi Marzo, VOverkleeft, HSvan der Stelt, M Discovery of glycine sulfonamides as dual inhibitors of sn-1-diacylglycerol lipasea anda/ß-hydrolase domain 6. J Med Chem 57:6610-22 (2014)  
Target
Name:
Diacylglycerol lipase-alpha
Synonyms:
C11orf11 DGLA_HUMAN NSDDR | Sn1-specific diacylglycerol lipase alpha
Type:
PROTEIN
Mol. Mass.:
114947.74
Organism:
Homo sapiens (Human)
Description:
ChEMBL_1449471
Residue:
1042
  
Inhibitor
Name:
BDBM50048620
Synonyms:
CHEMBL3319620
Type:
Small organic molecule
Emp. Form.:
C26H27NO6S
Mol. Mass.:
481.561
SMILES:
CC1(C)CCc2cc(ccc2O1)S(=O)(=O)N(CC(O)=O)Cc1ccc(Oc2ccccc2)cc1
: