Target
Tyrosine-protein phosphatase non-receptor type 22
Ligand
BDBM22851
Substrate
Meas. Tech.
ChEMBL_1453820 (CHEMBL3365197)
IC50
1100±n/a nM
Citation
 Thorson, MKPuerta, DTCohen, SMBarrios, AM Inhibition of the lymphoid tyrosine phosphatase: the effect of zinc(II) ions and chelating ligand fragments on enzymatic activity. Bioorg Med Chem Lett 24:4019-22 (2014)  
Target
Name:
Tyrosine-protein phosphatase non-receptor type 22
Synonyms:
3.1.3.48 LyP Lymphoid phosphatase (Lyp) PEST-domain phosphatase PTPN22 Tyrosine-protein phosphatase non-receptor type 22 (LYP) | tyrosine-protein phosphatase non-receptor type 22 isoform 1
Type:
Mol. Mass.:
91712.31
Organism:
Homo sapiens (Human)
Description:
Q9Y2R2
Residue:
807
  
Inhibitor
Name:
BDBM22851
Synonyms:
1,2-Dione-Based Compound, 8 1,2-naphthoquinone cid_10667
Type:
Small organic molecule
Emp. Form.:
C10H6O2
Mol. Mass.:
158.1534
SMILES:
O=C1C=Cc2ccccc2C1=O
: