Target
Adenosylhomocysteinase
Ligand
BDBM50050868
Substrate
Meas. Tech.
ChEMBL_1459288 (CHEMBL3367518)
IC50
49±n/a nM
Citation
 Nakao, ASuzuki, HUeno, HIwasaki, HSetsuta, T Discovery of S-adenosyl-L-homocysteine hydrolase inhibitors based on non-adenosine analogs. Bioorg Med Chem Lett 24:4336-40 (2014)  
Target
Name:
Adenosylhomocysteinase
Synonyms:
AHCY SAHH | SAHH_HUMAN
Type:
PROTEIN
Mol. Mass.:
47714.06
Organism:
Homo sapiens (Human)
Description:
ChEMBL_1507791
Residue:
432
  
Inhibitor
Name:
BDBM50050868
Synonyms:
CHEMBL3322556
Type:
Small organic molecule
Emp. Form.:
C31H36Cl2N4O3
Mol. Mass.:
583.549
SMILES:
CC(C)NCCNC(=O)CN(CC(=O)N(C)C1Cc2ccccc2C1)c1cc(Cl)ccc1Oc1ccc(Cl)cc1
: