Target
Indoleamine 2,3-dioxygenase 1
Ligand
BDBM50128548
Substrate
Meas. Tech.
ChEMBL_1452147 (CHEMBL3365093)
IC50
23000±n/a nM
Citation
 Röhrig, UFMajjigapu, SRChambon, MBron, SPilotte, LColau, DVan den Eynde, BJTurcatti, GVogel, PZoete, VMichielin, O Detailed analysis and follow-up studies of a high-throughput screening for indoleamine 2,3-dioxygenase 1 (IDO1) inhibitors. Eur J Med Chem 84:284-301 (2014)  
Target
Name:
Indoleamine 2,3-dioxygenase 1
Synonyms:
I23O1_HUMAN IDO-1 INDO Indoleamine 2,3-dioxygenase | Indoleamine-pyrrole 2,3-dioxygenase
Type:
Enzyme
Mol. Mass.:
45330.80
Organism:
Homo sapiens (Human)
Description:
P14902
Residue:
403
  
Inhibitor
Name:
BDBM50128548
Synonyms:
1-(1-Biphenyl-4-yl-2-phenyl-methyl)-1H-imidazole 1-(Biphenyl-4-yl-phenyl-methyl)-1H-imidazole( Bifanozole) 1-(biphenyl-4-yl-phenyl-methyl)-1H-imidazole CHEMBL277535 cid_2378
Type:
Small organic molecule
Emp. Form.:
C22H18N2
Mol. Mass.:
310.3917
SMILES:
c1cn(cn1)C(c1ccccc1)c1ccc(cc1)-c1ccccc1
: