Target
Acetylcholinesterase
Ligand
BDBM50052204
Substrate
Meas. Tech.
ChEMBL_1455653 (CHEMBL3365682)
Ki
1.1±n/a nM
Citation
 Akrami, HMirjalili, BFKhoobi, MNadri, HMoradi, ASakhteman, AEmami, SForoumadi, AShafiee, A Indolinone-based acetylcholinesterase inhibitors: synthesis, biological activity and molecular modeling. Eur J Med Chem 84:375-81 (2014)  
Target
Name:
Acetylcholinesterase
Synonyms:
ACES_ELEEL Acetylcholinesterase (EeAChE) | ache
Type:
Enzyme
Mol. Mass.:
71812.79
Organism:
Electrophorus electricus (Electric eel)
Description:
Residue:
633
  
Inhibitor
Name:
BDBM50052204
Synonyms:
CHEMBL3318392
Type:
Small organic molecule
Emp. Form.:
C21H16Cl2N2O
Mol. Mass.:
383.271
SMILES:
[Cl-].Clc1ccccc1C[n+]1ccc(\C=C2\C(=O)Nc3ccccc23)cc1
: