Target
Gamma-aminobutyric acid receptor subunit rho-1
Ligand
BDBM50052794
Substrate
Meas. Tech.
ChEMBL_1456653 (CHEMBL3370253)
EC50
>1000000±n/a nM
Citation
 Petersen, JGSørensen, TDamgaard, MNielsen, BJensen, AABalle, TBergmann, RFrølund, B Synthesis and pharmacological evaluation of 6-aminonicotinic acid analogues as novel GABA(A) receptor agonists. Eur J Med Chem 84:404-16 (2014)  
Target
Name:
Gamma-aminobutyric acid receptor subunit rho-1
Synonyms:
GABA receptor rho-1 subunit GABRR1 | GBRR1_HUMAN
Type:
PROTEIN
Mol. Mass.:
55892.34
Organism:
Homo sapiens (Human)
Description:
ChEMBL_1456653
Residue:
479
  
Inhibitor
Name:
BDBM50052794
Synonyms:
CHEMBL3322871
Type:
Small organic molecule
Emp. Form.:
C8H10N2O2
Mol. Mass.:
166.1772
SMILES:
CCc1nc(N)ccc1C(O)=O
: