Target
Tyrosine-protein phosphatase non-receptor type 11
Ligand
BDBM50054258
Substrate
Meas. Tech.
ChEMBL_1458320 (CHEMBL3369282)
IC50
310±n/a nM
Citation
 Zeng, LFZhang, RYYu, ZHLi, SWu, LGunawan, AMLane, BSMali, RSLi, XChan, RJKapur, RWells, CDZhang, ZY Therapeutic potential of targeting the oncogenic SHP2 phosphatase. J Med Chem 57:6594-609 (2014)  
Target
Name:
Tyrosine-protein phosphatase non-receptor type 11
Synonyms:
PTN11_HUMAN PTP-2C PTPN11 Protein tyrosine phosphatase (PTP) Shp2 Protein-tyrosine phosphatase 2C SHP2 Src homology phosphatase 2 (SHP-2) Tyrosine-protein phosphatase non-receptor type 11 (PTPN11) Tyrosine-protein phosphatase non-receptor type 11 (SHP2)
Type:
Protein phosphatase
Mol. Mass.:
68443.59
Organism:
Homo sapiens (Human)
Description:
Q06124
Residue:
597
  
Inhibitor
Name:
BDBM50054258
Synonyms:
CHEMBL3319377 US9844535, ID 11a-22 L97L07
Type:
Small organic molecule
Emp. Form.:
C31H21IN4O5
Mol. Mass.:
656.4267
SMILES:
Cn1c(c(I)c2cc(C(O)=O)c(O)cc12)-c1cccc(NC(=O)C(=O)Nc2ccc(cc2)-c2cccc(c2)C#N)c1
: