Target
P2Y purinoceptor 12
Ligand
BDBM50397205
Substrate
Meas. Tech.
ChEMBL_1454020 (CHEMBL3367079)
IC50
4160±n/a nM
Citation
 Boldron, CBesse, ABordes, MFTissandié, SYvon, XGau, BBadorc, ARousseaux, TBarré, GMeneyrol, JZech, GNazare, MFossey, VPflieger, AMBonnet-Lignon, SMillet, LBriot, CDol, FHérault, JPSavi, PLassalle, GDelesque, NHerbert, JMBono, F N-[6-(4-butanoyl-5-methyl-1H-pyrazol-1-yl)pyridazin-3-yl]-5-chloro-1-[2-(4-methylpiperazin-1-yl)-2-oxoethyl]-1H-indole-3-carboxamide (SAR216471), a novel intravenous and oral, reversible, and directly acting P2Y12 antagonist. J Med Chem 57:7293-316 (2014)  
Target
Name:
P2Y purinoceptor 12
Synonyms:
P2Y purinoceptor 12 P2ry12 Purinergic receptor P2Y12
Type:
PROTEIN
Mol. Mass.:
39068.50
Organism:
Rattus norvegicus
Description:
ChEMBL_1454020
Residue:
343
  
Inhibitor
Name:
BDBM50397205
Synonyms:
AR-C126532XX AZD6140 TICAGRELOR
Type:
Small organic molecule
Emp. Form.:
C23H28F2N6O4S
Mol. Mass.:
522.568
SMILES:
CCCSc1nc(N[C@@H]2C[C@H]2c2ccc(F)c(F)c2)c2nnn([C@@H]3C[C@H](OCCO)[C@@H](O)[C@H]3O)c2n1
: