Target
Activin receptor type-1
Ligand
BDBM50056678
Substrate
Meas. Tech.
ChEMBL_1453218 (CHEMBL3365511)
IC50
520±n/a nM
Citation
 Mohedas, AHWang, YSanvitale, CECanning, PChoi, SXing, XBullock, ANCuny, GDYu, PB Structure-activity relationship of 3,5-diaryl-2-aminopyridine ALK2 inhibitors reveals unaltered binding affinity for fibrodysplasia ossificans progressiva causing mutants. J Med Chem 57:7900-15 (2014)  
Target
Name:
Activin receptor type-1
Synonyms:
ACVR1_MOUSE ActR-I Acvr Acvrlk2 | Tgfb1
Type:
Protein
Mol. Mass.:
57231.35
Organism:
Mus musculus
Description:
Residue:
509
  
Inhibitor
Name:
BDBM50056678
Synonyms:
CHEMBL3341792
Type:
Small organic molecule
Emp. Form.:
C24H23N5
Mol. Mass.:
381.4729
SMILES:
Nc1ncc(cc1-c1ccnc2ccccc12)-c1cccc(c1)N1CCNCC1
: