Target
Reverse transcriptase
Ligand
BDBM50011181
Substrate
Meas. Tech.
ChEMBL_1450647 (CHEMBL3362711)
IC50
2800±n/a nM
Citation
 Lacbay, CMMancuso, JLin, YSBennett, NGötte, MTsantrizos, YS Modular assembly of purine-like bisphosphonates as inhibitors of HIV-1 reverse transcriptase. J Med Chem 57:7435-49 (2014)  
Target
Name:
Reverse transcriptase
Synonyms:
Type:
Protein
Mol. Mass.:
29598.37
Organism:
Human immunodeficiency virus 1
Description:
Q9WKE8
Residue:
254
  
Inhibitor
Name:
BDBM50011181
Synonyms:
(PFA)dihydroxyphosphinecarboxylic acid oxide FOSCARNET Foscarnet (PFA) Phosphono-formic acid(PFA) dihydroxyphosphinecarboxylic acid oxide phosphonoformic acid(PFA)
Type:
Small organic molecule
Emp. Form.:
CH3O5P
Mol. Mass.:
126.0053
SMILES:
OC(=O)P(O)(O)=O
: