Target
Adenosine receptor A2a
Ligand
BDBM50059806
Substrate
Meas. Tech.
ChEMBL_1461353 (CHEMBL3396203)
IC50
1514±n/a nM
Citation
 Jörg, MMay, LTMak, FSLee, KCMiller, NDScammells, PJCapuano, B Synthesis and pharmacological evaluation of dual acting ligands targeting the adenosine A2A and dopamine D2 receptors for the potential treatment of Parkinson's disease. J Med Chem 58:718-38 (2015)  
Target
Name:
Adenosine receptor A2a
Synonyms:
A2A adenosine receptor (hA2A) ADENOSINE A2 ADORA2 Adenosine A2A receptor (A2AAR)
Type:
G Protein-Coupled Receptor (GPCR)
Mol. Mass.:
44716.46
Organism:
Homo sapiens (Human)
Description:
P29274
Residue:
412
  
Inhibitor
Name:
BDBM50059806
Synonyms:
CHEMBL3394271
Type:
Small organic molecule
Emp. Form.:
C23H25N9O2
Mol. Mass.:
459.5037
SMILES:
Nc1nc(NC2CCN(CCc3cccc4NC(=O)Cc34)CC2)nc2nc(nn12)-c1ccco1
: