Target
Adenosine receptor A2a
Ligand
BDBM50059848
Substrate
Meas. Tech.
ChEMBL_1461353 (CHEMBL3396203)
IC50
120±n/a nM
Citation
 Jörg, MMay, LTMak, FSLee, KCMiller, NDScammells, PJCapuano, B Synthesis and pharmacological evaluation of dual acting ligands targeting the adenosine A2A and dopamine D2 receptors for the potential treatment of Parkinson's disease. J Med Chem 58:718-38 (2015)  
Target
Name:
Adenosine receptor A2a
Synonyms:
A2A adenosine receptor (hA2A) ADENOSINE A2 ADORA2 Adenosine A2A receptor (A2AAR)
Type:
G Protein-Coupled Receptor (GPCR)
Mol. Mass.:
44716.46
Organism:
Homo sapiens (Human)
Description:
P29274
Residue:
412
  
Inhibitor
Name:
BDBM50059848
Synonyms:
CHEMBL3394262
Type:
Small organic molecule
Emp. Form.:
C40H48N14O6
Mol. Mass.:
820.8993
SMILES:
OC=O.CCCN(CCCNc1nc(Oc2ccc(CCNc3nc(N)n4nc(nc4n3)-c3ccco3)cc2)nc(n1)N1CCOCC1)CCc1cccc2NC(=O)Cc12
: