Target
D(2) dopamine receptor
Ligand
BDBM50059836
Substrate
Meas. Tech.
ChEMBL_1461354 (CHEMBL3396204)
EC50
389±n/a nM
Citation
 Jörg, MMay, LTMak, FSLee, KCMiller, NDScammells, PJCapuano, B Synthesis and pharmacological evaluation of dual acting ligands targeting the adenosine A2A and dopamine D2 receptors for the potential treatment of Parkinson's disease. J Med Chem 58:718-38 (2015)  
Target
Name:
D(2) dopamine receptor
Synonyms:
D(2) dopamine receptor DOPAMINE D2 Long DRD2 Dopamine D2 receptor Dopamine D2 receptor (D2R) Dopamine2-like | d2
Type:
Cell-surface receptors
Mol. Mass.:
50647.10
Organism:
Homo sapiens (Human)
Description:
P14416
Residue:
443
  
Inhibitor
Name:
BDBM50059836
Synonyms:
CHEMBL3394264
Type:
Small organic molecule
Emp. Form.:
C22H25N9O2
Mol. Mass.:
447.493
SMILES:
CN(CCCNc1nc(N)n2nc(nc2n1)-c1ccco1)CCc1cccc2NC(=O)Cc12
: