Target
Growth hormone secretagogue receptor type 1
Ligand
BDBM50061723
Substrate
Meas. Tech.
ChEMBL_1461883 (CHEMBL3396113)
Ki
166±n/a nM
Citation
 Orr, STBeveridge, RBhattacharya, SKCameron, KOCoffey, SFernando, DHepworth, DJackson, MVKhot, VKosa, RLapham, KLoria, PMMcClure, KFPatel, JRose, CSaenz, JStock, IAStorer, Gvon Volkenburg, MVrieze, DWang, GXiao, JZhang, Y Evaluation and synthesis of polar aryl- and heteroaryl spiroazetidine-piperidine acetamides as ghrelin inverse agonists. ACS Med Chem Lett 6:156-61 (2015)  
Target
Name:
Growth hormone secretagogue receptor type 1
Synonyms:
GH-releasing peptide receptor GHS-R GHSR_HUMAN Ghrelin receptor | Ghrelin receptor 1a (GHS-R1a)
Type:
Receptor
Mol. Mass.:
41334.57
Organism:
Homo sapiens (Human)
Description:
Receptor binding studies use plasma membranes from LLC PK-1 cells transiently transfected with hGHSR1a.
Residue:
366
  
Inhibitor
Name:
BDBM50061723
Synonyms:
CHEMBL3394197
Type:
Small organic molecule
Emp. Form.:
C30H33N7O
Mol. Mass.:
507.6293
SMILES:
Cc1cc(ncn1)-c1ccc2[C@@H](CCc2c1)N1CC2(C1)CCN(CC2)C(=O)Cc1nn(C)c2ncccc12
: