Target
3-oxoacyl-ACP synthase
Ligand
BDBM50062147
Substrate
Meas. Tech.
ChEMBL_1462635 (CHEMBL3399322)
IC50
23000±n/a nM
Citation
 Allegretta, GWeidel, EEmpting, MHartmann, RW Catechol-based substrates of chalcone synthase as a scaffold for novel inhibitors of PqsD. Eur J Med Chem 90:351-9 (2015)  
Target
Name:
3-oxoacyl-ACP synthase
Synonyms:
2-heptyl-4(1H)-quinolone synthase PqsD 3-oxoacyl-ACP synthase PA8380_44470 PQB biosynthetic 3-oxoacyl-[acyl-carrier-protein] synthase III pqsD
Type:
PROTEIN
Mol. Mass.:
36357.84
Organism:
Pseudomonas aeruginosa
Description:
ChEMBL_109728
Residue:
337
  
Inhibitor
Name:
BDBM50062147
Synonyms:
CHEMBL3120494
Type:
Small organic molecule
Emp. Form.:
C9H10O4
Mol. Mass.:
182.1733
SMILES:
COC(=O)Cc1ccc(O)c(O)c1
: