Target
Heat shock protein HSP 90-alpha
Ligand
BDBM50008057
Substrate
Meas. Tech.
ChEMBL_1464910 (CHEMBL3404380)
Ki
29±n/a nM
Citation
 Neubert, TNuma, MErnst, JClemens, JKrenitsky, PLiu, MFleck, BWoody, LZuccola, HStamos, D Discovery of novel oxazepine and diazepine carboxamides as two new classes of heat shock protein 90 inhibitors. Bioorg Med Chem Lett 25:1338-42 (2015)  
Target
Name:
Heat shock protein HSP 90-alpha
Synonyms:
HS90A_HUMAN HSP86 HSP90AA1 HSPCA Heat shock 86 kDa Heat shock protein HSP 90-alpha (HSP90) LAP-2 Lipopolysaccharide-associated protein 2 heat shock protein 90kDa alpha (cytosolic), class A member 1 isoform 2
Type:
Molecular Chaperone
Mol. Mass.:
84623.45
Organism:
Homo sapiens (Human)
Description:
P07900
Residue:
732
  
Inhibitor
Name:
BDBM50008057
Synonyms:
BMS-722782 TANESPIMYCIN
Type:
Small organic molecule
Emp. Form.:
C31H43N3O8
Mol. Mass.:
585.6884
SMILES:
CO[C@H]1C[C@H](C)CC2=C(NCC=C)C(=O)C=C(NC(=O)\C(C)=C\C=C/[C@H](OC)[C@@H](OC(N)=O)\C(C)=C\[C@H](C)[C@H]1O)C2=O
: