Target
Lysophosphatidic acid receptor 2
Ligand
BDBM50065611
Substrate
Meas. Tech.
ChEMBL_1463951 (CHEMBL3405603)
IC50
>800±n/a nM
Citation
 Kusumi, KShinozaki, KKanaji, TKurata, HNaganawa, AOtsuki, KMatsushita, TSekiguchi, TKakuuchi, ASeko, T Discovery of novel S1P2 antagonists. Part 1: discovery of 1,3-bis(aryloxy)benzene derivatives. Bioorg Med Chem Lett 25:1479-82 (2015)  
Target
Name:
Lysophosphatidic acid receptor 2
Synonyms:
EDG4 LPA-2 LPAR2 Lysophosphatidic acid receptor 2 | Lysophosphatidic acid receptor Edg-4
Type:
PROTEIN
Mol. Mass.:
39103.44
Organism:
Homo sapiens (Human)
Description:
ChEMBL_1451385
Residue:
351
  
Inhibitor
Name:
BDBM50065611
Synonyms:
CHEMBL3401383
Type:
Small organic molecule
Emp. Form.:
C31H36FN3O5
Mol. Mass.:
549.633
SMILES:
CCC(CC)CC1(O)CCN(CC1)C(=O)Nc1cc(Oc2ccc(F)cc2)cc(Oc2ccc(cc2)C(N)=O)c1
: