Target
DNA gyrase subunit B
Ligand
BDBM50423645
Substrate
Meas. Tech.
ChEMBL_1465095 (CHEMBL3405427)
Temperature
298.15±n/a K
IC50
46±n/a nM
Comments
extracted
Citation
 Saxena, SSamala, GRenuka, JSridevi, JPYogeeswari, PSriram, D Development of 2-amino-5-phenylthiophene-3-carboxamide derivatives as novel inhibitors of Mycobacterium tuberculosis DNA GyrB domain. Bioorg Med Chem 23:1402-12 (2015)  
Target
Name:
DNA gyrase subunit B
Synonyms:
GYRB_MYCSM | gyrB
Type:
PROTEIN
Mol. Mass.:
74505.25
Organism:
Mycobacterium smegmatis
Description:
ChEMBL_107961
Residue:
675
  
Inhibitor
Name:
BDBM50423645
Synonyms:
Albamycin NOVOBIOCIN
Type:
Small organic molecule
Emp. Form.:
C31H36N2O11
Mol. Mass.:
612.6243
SMILES:
[#6]-[#8]-[#6@@H]1-[#6@@H](-[#8]-[#6](-[#7])=O)-[#6@H](-[#8])-[#6@@H](-[#8]-c2ccc3c(-[#8])c(-[#7]-[#6](=O)-c4ccc(-[#8])c(-[#6]\[#6]=[#6](\[#6])-[#6])c4)c(=O)oc3c2-[#6])-[#8]C1([#6])[#6]
: