Target
Muscarinic acetylcholine receptor M1
Ligand
BDBM50066850
Substrate
Meas. Tech.
ChEMBL_1465996 (CHEMBL3406978)
IC50
0.900000±n/a nM
Citation
 Prat, MBuil, MAFernández, MDTort, LMonleón, JMCasals, GFerrer, MCastro, JGavaldà, AMiralpeix, MRamos, IVilella, DHuerta, JMEspinosa, SHernández, BSegarra, VCórdoba, M Discovery of novel quaternary ammonium derivatives of (3R)-quinuclidinyl amides as potent and long acting muscarinic antagonists. Bioorg Med Chem Lett 25:1736-41 (2015)  
Target
Name:
Muscarinic acetylcholine receptor M1
Synonyms:
ACM1_HUMAN Cholinergic receptor, muscarinic 1 | Cholinergic, muscarinic M1
Type:
Protein
Mol. Mass.:
51442.54
Organism:
Homo sapiens (Human)
Description:
P11229
Residue:
460
  
Inhibitor
Name:
BDBM50066850
Synonyms:
CHEMBL3401641
Type:
Small organic molecule
Emp. Form.:
C17H20N2O2S2
Mol. Mass.:
348.483
SMILES:
OC(C(=O)N[C@H]1CN2CCC1CC2)(c1cccs1)c1cccs1
: