Target
Muscarinic acetylcholine receptor M2
Ligand
BDBM50066861
Substrate
Meas. Tech.
ChEMBL_1465997 (CHEMBL3406979)
IC50
0.200000±n/a nM
Citation
 Prat, MBuil, MAFernández, MDTort, LMonleón, JMCasals, GFerrer, MCastro, JGavaldà, AMiralpeix, MRamos, IVilella, DHuerta, JMEspinosa, SHernández, BSegarra, VCórdoba, M Discovery of novel quaternary ammonium derivatives of (3R)-quinuclidinyl amides as potent and long acting muscarinic antagonists. Bioorg Med Chem Lett 25:1736-41 (2015)  
Target
Name:
Muscarinic acetylcholine receptor M2
Synonyms:
ACM2_HUMAN Cholinergic, muscarinic M2 Muscarinic acetylcholine receptor M2 and M5 | RecName: Full=Muscarinic acetylcholine receptor M2
Type:
GPCR
Mol. Mass.:
51730.61
Organism:
Homo sapiens (Human)
Description:
P08172
Residue:
466
  
Inhibitor
Name:
BDBM50066861
Synonyms:
BA-679-BR Tiotropium Bromide | Tiotropium Bromide Monohydrate
Type:
Small organic molecule
Emp. Form.:
C19H24BrNO5S2
Mol. Mass.:
490.432
SMILES:
O.[Br-].[H][C@]12O[C@@]1([H])[C@]1([H])C[C@@]([H])(C[C@@]2([H])[N+]1(C)C)OC(=O)C(O)(c1cccs1)c1cccs1
: