Target
11-beta-hydroxysteroid dehydrogenase 1
Ligand
BDBM50066892
Substrate
Meas. Tech.
ChEMBL_1466125 (CHEMBL3404743)
IC50
1.8±n/a nM
Citation
 Ryu, JHKim, SLee, JAHan, HYSon, HJLee, HJKim, YHKim, JSPark, HG Synthesis and optimization of picolinamide derivatives as a novel class of 11ß-hydroxysteroid dehydrogenase type 1 (11ß-HSD1) inhibitors. Bioorg Med Chem Lett 25:1679-83 (2015)  
Target
Name:
11-beta-hydroxysteroid dehydrogenase 1
Synonyms:
11-DH 11-beta-Hydroxysteroid Dehydrogenase 1 (11-beta-HSD1) 11beta-HSD1A Corticosteroid 11-beta-dehydrogenase isozyme 1 (11-beta-HSD-1) Hsd11 | Hsd11b1
Type:
Enzyme
Mol. Mass.:
32369.70
Organism:
Mus musculus (mouse)
Description:
P50172
Residue:
292
  
Inhibitor
Name:
BDBM50066892
Synonyms:
CHEMBL3401681
Type:
Small organic molecule
Emp. Form.:
C28H36N4O4S
Mol. Mass.:
524.675
SMILES:
C[C@@H]1CN(CCN1c1cccc(n1)C(=O)N[C@H]1C2CC3CC1C[C@](O)(C3)C2)c1ccc(cc1)S(C)(=O)=O
: