Target
High affinity choline transporter 1
Ligand
BDBM50067210
Substrate
Meas. Tech.
ChEMBL_1464246 (CHEMBL3404113)
IC50
6120±n/a nM
Citation
 Bollinger, SREngers, DWEnnis, EAWright, JLocuson, CWLindsley, CWBlakely, RDHopkins, CR Synthesis and structure-activity relationships of a series of 4-methoxy-3-(piperidin-4-yl)oxy benzamides as novel inhibitors of the presynaptic choline transporter. Bioorg Med Chem Lett 25:1757-60 (2015)  
Target
Name:
High affinity choline transporter 1
Synonyms:
CHT1 SC5A7_HUMAN high affinity choline transporter 1
Type:
PROTEIN
Mol. Mass.:
63194.33
Organism:
Homo sapiens (Human)
Description:
ChEMBL_1464247
Residue:
580
  
Inhibitor
Name:
BDBM50067210
Synonyms:
CHEMBL3303803
Type:
Small organic molecule
Emp. Form.:
C21H29N3O5
Mol. Mass.:
403.4721
SMILES:
COc1ccc(cc1OCCN1CCOCC1)C(=O)NCc1cc(no1)C(C)C
: