Target
High affinity choline transporter 1
Ligand
BDBM50067201
Substrate
Meas. Tech.
ChEMBL_1464247 (CHEMBL3404114)
IC50
2510±n/a nM
Citation
 Bollinger, SREngers, DWEnnis, EAWright, JLocuson, CWLindsley, CWBlakely, RDHopkins, CR Synthesis and structure-activity relationships of a series of 4-methoxy-3-(piperidin-4-yl)oxy benzamides as novel inhibitors of the presynaptic choline transporter. Bioorg Med Chem Lett 25:1757-60 (2015)  
Target
Name:
High affinity choline transporter 1
Synonyms:
CHT1 SC5A7_HUMAN high affinity choline transporter 1
Type:
PROTEIN
Mol. Mass.:
63194.33
Organism:
Homo sapiens (Human)
Description:
ChEMBL_1464247
Residue:
580
  
Inhibitor
Name:
BDBM50067201
Synonyms:
CHEMBL3186365
Type:
Small organic molecule
Emp. Form.:
C22H32N4O3
Mol. Mass.:
400.5145
SMILES:
COc1ccc(cc1OC1CCN(CC1)C(C)C)C(=O)NCc1cc(C)n(C)n1
: