Target
Alkaline phosphatase, tissue-nonspecific isozyme
Ligand
BDBM50068228
Substrate
Meas. Tech.
ChEMBL_1464323 (CHEMBL3404590)
Ki
918±n/a nM
Citation
 Al-Rashida, MEjaz, SAAli, SShaukat, AHamayoun, MAhmed, MIqbal, J Diarylsulfonamides and their bioisosteres as dual inhibitors of alkaline phosphatase and carbonic anhydrase: Structure activity relationship and molecular modelling studies. Bioorg Med Chem 23:2435-44 (2015)  
Target
Name:
Alkaline phosphatase, tissue-nonspecific isozyme
Synonyms:
ALPL Alkaline phosphatase liver/bone/kidney isozyme PPBT_BOVIN Tissue non-specific alkaline phosphatase (TNAP)
Type:
Protein
Mol. Mass.:
57195.60
Organism:
Bos taurus (Cattle)
Description:
P09487
Residue:
524
  
Inhibitor
Name:
BDBM50068228
Synonyms:
CHEMBL3403317
Type:
Small organic molecule
Emp. Form.:
C14H14N2O3S
Mol. Mass.:
290.338
SMILES:
NS(=O)(=O)c1ccc(CNC(=O)c2ccccc2)cc1
: