Target
Acetyl-CoA carboxylase 1
Ligand
BDBM50069756
Substrate
Meas. Tech.
ChEMBL_1469476 (CHEMBL3412273)
IC50
2.6±n/a nM
Citation
 Bourbeau, MPBartberger, MD Recent advances in the development of acetyl-CoA carboxylase (ACC) inhibitors for the treatment of metabolic disease. J Med Chem 58:525-36 (2015)  
Target
Name:
Acetyl-CoA carboxylase 1
Synonyms:
ACAC ACACA_HUMAN ACC1 Acetyl-CoA carboxylase 1 | Acetyl-CoA carboxylase 1 (ACC1)
Type:
Protein
Mol. Mass.:
265543.22
Organism:
Homo sapiens (Human)
Description:
Q13085
Residue:
2346
  
Inhibitor
Name:
BDBM50069756
Synonyms:
CHEMBL3407547 ND-630 US10995099, Example 38 | US11186587, Example ND-630
Type:
Small organic molecule
Emp. Form.:
C28H31N3O8S
Mol. Mass.:
569.626
SMILES:
COc1ccccc1[C@H](Cn1c2sc(c(C)c2c(=O)n(c1=O)C(C)(C)C(O)=O)-c1ncco1)OC1CCOCC1
: