Target
5-hydroxytryptamine receptor 2C
Ligand
BDBM85098
Substrate
Meas. Tech.
ChEMBL_1468611 (CHEMBL3413557)
Ki
0.600000±n/a nM
Citation
 Kolaczkowski, MMarcinkowska, MBucki, ASniecikowska, JPawlowski, MKazek, GSiwek, AJastrzebska-Wiesek, MPartyka, AWasik, AWesolowska, AMierzejewski, PBienkowski, P Novel 5-HT6 receptor antagonists/D2 receptor partial agonists targeting behavioral and psychological symptoms of dementia. Eur J Med Chem 92:221-35 (2015)  
Target
Name:
5-hydroxytryptamine receptor 2C
Synonyms:
5-HT-2C 5-HT2C-INI 5-HTR2C 5-hydroxytryptamine receptor 2C (5-HT-2C) 5HT-1C HTR1C Serotonin (5-HT3) receptor Serotonin Receptor 2C
Type:
G Protein-Coupled Receptor (GPCR)
Mol. Mass.:
51836.79
Organism:
Homo sapiens (Human)
Description:
P28335
Residue:
458
  
Inhibitor
Name:
BDBM85098
Synonyms:
N-[5-[5-(2,4-Dioxo-1,3,8-triazaspiro[4.5]decan-8-yl)-1-oxopentyl]-2,4-dimethoxyphenyl]-4-(trifluoromethyl)benzenesulfonamide | RS-102221
Type:
Small organic molecule
Emp. Form.:
C27H31F3N4O7S
Mol. Mass.:
612.618
SMILES:
[#6]-[#8]-c1cc(-[#8]-[#6])c(cc1-[#7][S;v6](=O)(=O)c1ccc(cc1)C(F)(F)F)-[#6](=O)-[#6]-[#6]-[#6]-[#6]-[#7]-1-[#6]-[#6]C2([#6]-[#6]-1)[#7]-[#6](=O)-[#7]-[#6]2=O
: