Target
Bromodomain-containing protein 4
Ligand
BDBM50071106
Substrate
Meas. Tech.
ChEMBL_1469310 (CHEMBL3414207)
IC50
140±n/a nM
Citation
 Zhao, LWang, YCao, DChen, TWang, QLi, YXu, YZhang, NWang, XChen, DChen, LChen, YLXia, GShi, ZLiu, YCLin, YMiao, ZShen, JXiong, B Fragment-based drug discovery of 2-thiazolidinones as BRD4 inhibitors: 2. Structure-based optimization. J Med Chem 58:1281-97 (2015)  
Target
Name:
Bromodomain-containing protein 4
Synonyms:
BRD4 Bromodomain-containing protein 4 (BRD4) Protein HUNK1
Type:
Protein
Mol. Mass.:
152264.84
Organism:
Homo sapiens (Human)
Description:
O60885
Residue:
1362
  
Inhibitor
Name:
BDBM50071106
Synonyms:
CHEMBL3410002
Type:
Small organic molecule
Emp. Form.:
C15H19N3O3S2
Mol. Mass.:
353.46
SMILES:
Cc1c(N)cc(cc1S(=O)(=O)NC1CCCC1)-c1csc(=O)[nH]1
: