Target
LIM domain kinase 1
Ligand
BDBM50072728
Substrate
Meas. Tech.
ChEMBL_1467101 (CHEMBL3411298)
IC50
20±n/a nM
Citation
 Yin, YZheng, KEid, NHoward, SJeong, JHYi, FGuo, JPark, CMBibian, MWu, WHernandez, PPark, HWu, YLuo, JLLoGrasso, PVFeng, Y Bis-aryl urea derivatives as potent and selective LIM kinase (Limk) inhibitors. J Med Chem 58:1846-61 (2015)  
Target
Name:
LIM domain kinase 1
Synonyms:
LIMK LIMK1 | LIMK1_HUMAN
Type:
Enzyme Catalytic Domain
Mol. Mass.:
72591.81
Organism:
Homo sapiens (Human)
Description:
gi_4505001
Residue:
647
  
Inhibitor
Name:
BDBM50072728
Synonyms:
CHEMBL3410052
Type:
Small organic molecule
Emp. Form.:
C24H25ClN6O
Mol. Mass.:
448.948
SMILES:
CN(C)CCN(C(=O)Nc1ccc(cc1)-c1ncnc2[nH]cc(C)c12)c1ccc(Cl)cc1
: