Target
Cannabinoid receptor 2
Ligand
BDBM50353091
Substrate
Meas. Tech.
ChEMBL_1468240 (CHEMBL3411783)
Ki
0.019999±n/a nM
Citation
 Han, SZhang, FFQian, HYChen, LLPu, JBXie, XChen, JZ Design, syntheses, structure-activity relationships and docking studies of coumarin derivatives as novel selective ligands for the CB2 receptor. Eur J Med Chem 93:16-32 (2015)  
Target
Name:
Cannabinoid receptor 2
Synonyms:
CANNABINOID CB2 CB2 CB2B CNR2_HUMAN Cannabinoid CB2 receptor Cannabinoid receptor 2 (CB2R) | hCB2
Type:
G Protein-Coupled Receptor (GPCR)
Mol. Mass.:
39690.94
Organism:
Homo sapiens (Human)
Description:
P34972
Residue:
360
  
Inhibitor
Name:
BDBM50353091
Synonyms:
CHEMBL1822944
Type:
Small organic molecule
Emp. Form.:
C20H21N3O4
Mol. Mass.:
367.3984
SMILES:
CCOc1c(OC)ccc2cc(C(=O)NCCc3ccncc3)c(=O)[nH]c12
: