Target
Muscarinic acetylcholine receptor M1
Ligand
BDBM50008072
Substrate
Meas. Tech.
ChEMBL_1473513 (CHEMBL3420196)
EC50
832±n/a nM
Citation
 Chen, XKlöckner, JHolze, JZimmermann, CSeemann, WKSchrage, RBock, AMohr, KTränkle, CHolzgrabe, UDecker, M Rational design of partial agonists for the muscarinic m1 acetylcholine receptor. J Med Chem 58:560-76 (2015)  
Target
Name:
Muscarinic acetylcholine receptor M1
Synonyms:
ACM1_HUMAN Cholinergic receptor, muscarinic 1 | Cholinergic, muscarinic M1
Type:
Protein
Mol. Mass.:
51442.54
Organism:
Homo sapiens (Human)
Description:
P11229
Residue:
460
  
Inhibitor
Name:
BDBM50008072
Synonyms:
(+)-pilocarpine (3S,4R)-3-ethyldihydro-4-((1-methyl-1H-imidazol-5-yl)methyl)-2(3H)-furanone CHEMBL550 PILOCARPINE | PILOCARPINE HYDROCHLORIDE
Type:
Small organic molecule
Emp. Form.:
C11H16N2O2
Mol. Mass.:
208.2569
SMILES:
CC[C@H]1[C@@H](Cc2cncn2C)COC1=O
: