Target
Aldehyde dehydrogenase X, mitochondrial
Ligand
BDBM50076553
Substrate
Meas. Tech.
ChEMBL_1473083 (CHEMBL3421193)
IC50
>100000±n/a nM
Citation
 Morgan, CAHurley, TD Characterization of two distinct structural classes of selective aldehyde dehydrogenase 1A1 inhibitors. J Med Chem 58:1964-75 (2015)  
Target
Name:
Aldehyde dehydrogenase X, mitochondrial
Synonyms:
AL1B1_HUMAN ALDH5 Aldehyde dehydrogenase 5 | Aldehyde dehydrogenase family 1 member B1
Type:
PROTEIN
Mol. Mass.:
57207.14
Organism:
Homo sapiens (Human)
Description:
ChEMBL_109700
Residue:
517
  
Inhibitor
Name:
BDBM50076553
Synonyms:
CHEMBL1538964
Type:
Small organic molecule
Emp. Form.:
C17H27N5O3
Mol. Mass.:
349.428
SMILES:
CC(C)CCn1c(CN2CCOCC2)nc2n(C)c(=O)n(C)c(=O)c12
: