Target
3-oxoacyl-ACP synthase
Ligand
BDBM50079640
Substrate
Meas. Tech.
ChEMBL_1472518 (CHEMBL3421140)
IC50
32000±n/a nM
Citation
 Sahner, JHEmpting, MKamal, AWeidel, EGroh, MBörger, CHartmann, RW Exploring the chemical space of ureidothiophene-2-carboxylic acids as inhibitors of the quorum sensing enzyme PqsD from Pseudomonas aeruginosa. Eur J Med Chem 96:14-21 (2015)  
Target
Name:
3-oxoacyl-ACP synthase
Synonyms:
2-heptyl-4(1H)-quinolone synthase PqsD 3-oxoacyl-ACP synthase PA8380_44470 PQB biosynthetic 3-oxoacyl-[acyl-carrier-protein] synthase III pqsD
Type:
PROTEIN
Mol. Mass.:
36357.84
Organism:
Pseudomonas aeruginosa
Description:
ChEMBL_109728
Residue:
337
  
Inhibitor
Name:
BDBM50079640
Synonyms:
CHEMBL3414808
Type:
Small organic molecule
Emp. Form.:
C26H27N3O6S2
Mol. Mass.:
541.639
SMILES:
COc1ccc(cc1)-c1cc(NC(=O)N[C@@H](Cc2ccccc2)C(=O)SCCNC(C)=O)c(s1)C(O)=O
: