Target
3-oxoacyl-ACP synthase
Ligand
BDBM50079711
Substrate
Meas. Tech.
ChEMBL_1472518 (CHEMBL3421140)
IC50
21600±n/a nM
Citation
 Sahner, JHEmpting, MKamal, AWeidel, EGroh, MBörger, CHartmann, RW Exploring the chemical space of ureidothiophene-2-carboxylic acids as inhibitors of the quorum sensing enzyme PqsD from Pseudomonas aeruginosa. Eur J Med Chem 96:14-21 (2015)  
Target
Name:
3-oxoacyl-ACP synthase
Synonyms:
2-heptyl-4(1H)-quinolone synthase PqsD 3-oxoacyl-ACP synthase PA8380_44470 PQB biosynthetic 3-oxoacyl-[acyl-carrier-protein] synthase III pqsD
Type:
PROTEIN
Mol. Mass.:
36357.84
Organism:
Pseudomonas aeruginosa
Description:
ChEMBL_109728
Residue:
337
  
Inhibitor
Name:
BDBM50079711
Synonyms:
CHEMBL3414796
Type:
Small organic molecule
Emp. Form.:
C21H18N2O6S
Mol. Mass.:
426.442
SMILES:
OC(=O)[C@H](Cc1ccccc1)NC(=O)Nc1cc(sc1C(O)=O)-c1ccc(O)cc1
: