Target
3-oxoacyl-ACP synthase
Ligand
BDBM50079769
Substrate
Meas. Tech.
ChEMBL_1472518 (CHEMBL3421140)
IC50
31900±n/a nM
Citation
 Sahner, JHEmpting, MKamal, AWeidel, EGroh, MBörger, CHartmann, RW Exploring the chemical space of ureidothiophene-2-carboxylic acids as inhibitors of the quorum sensing enzyme PqsD from Pseudomonas aeruginosa. Eur J Med Chem 96:14-21 (2015)  
Target
Name:
3-oxoacyl-ACP synthase
Synonyms:
2-heptyl-4(1H)-quinolone synthase PqsD 3-oxoacyl-ACP synthase PA8380_44470 PQB biosynthetic 3-oxoacyl-[acyl-carrier-protein] synthase III pqsD
Type:
PROTEIN
Mol. Mass.:
36357.84
Organism:
Pseudomonas aeruginosa
Description:
ChEMBL_109728
Residue:
337
  
Inhibitor
Name:
BDBM50079769
Synonyms:
CHEMBL3414791
Type:
Small organic molecule
Emp. Form.:
C18H20N2O6S
Mol. Mass.:
392.426
SMILES:
COc1ccc(cc1)-c1cc(NC(=O)N[C@@H](C(C)C)C(O)=O)c(s1)C(O)=O
: