Target
Aldo-keto reductase family 1 member B7
Ligand
BDBM50080471
Substrate
Meas. Tech.
ChEMBL_1475204 (CHEMBL3424959)
IC50
24790±n/a nM
Citation
 Stefek, MSoltesova Prnova, MMajekova, MRechlin, CHeine, AKlebe, G Identification of novel aldose reductase inhibitors based on carboxymethylated mercaptotriazinoindole scaffold. J Med Chem 58:2649-57 (2015)  
Target
Name:
Aldo-keto reductase family 1 member B7
Synonyms:
ALD1_RAT Akr1b7 Aldo-keto reductase family 1 member B7 Aldose reductase-related protein 1
Type:
PROTEIN
Mol. Mass.:
36127.39
Organism:
Rattus norvegicus
Description:
ChEMBL_109605
Residue:
316
  
Inhibitor
Name:
BDBM50080471
Synonyms:
CHEMBL1984484
Type:
Small organic molecule
Emp. Form.:
C16H11N3O2
Mol. Mass.:
277.2774
SMILES:
OC(=O)Cn1c2ccccc2c2nc3ccccc3nc12
: