Target
Aldo-keto reductase family 1 member B1
Ligand
BDBM16469
Substrate
Meas. Tech.
ChEMBL_1475201 (CHEMBL3424956)
IC50
5.0±n/a nM
Citation
 Stefek, MSoltesova Prnova, MMajekova, MRechlin, CHeine, AKlebe, G Identification of novel aldose reductase inhibitors based on carboxymethylated mercaptotriazinoindole scaffold. J Med Chem 58:2649-57 (2015)  
Target
Name:
Aldo-keto reductase family 1 member B1
Synonyms:
ALDR_RAT Akr1b4 Aldr1
Type:
PROTEIN
Mol. Mass.:
35797.87
Organism:
Rattus norvegicus
Description:
ChEMBL_1512484
Residue:
316
  
Inhibitor
Name:
BDBM16469
Synonyms:
2-{3-[(4,5,7-trifluoro-1,3-benzothiazol-2-yl)methyl]-1H-indol-1-yl}acetic acid IDD-676 Lidorestat | {3-[(4,5,7-trifluoro-1,3-benzothiazol-2-yl)methyl]-1H-indol-1-yl}acetic acid
Type:
Small organic molecule
Emp. Form.:
C18H11F3N2O2S
Mol. Mass.:
376.352
SMILES:
OC(=O)Cn1cc(Cc2nc3c(F)c(F)cc(F)c3s2)c2ccccc12
: