Target
6-phosphofructo-2-kinase/fructose-2,6-bisphosphatase 1
Ligand
BDBM50082136
Substrate
Meas. Tech.
ChEMBL_1475278 (CHEMBL3425138)
IC50
2530±n/a nM
Citation
 Boyd, SBrookfield, JLCritchlow, SECumming, IACurtis, NJDebreczeni, JDegorce, SLDonald, CEvans, NJGroombridge, SHopcroft, PJones, NPKettle, JGLamont, SLewis, HJMacFaull, PMcLoughlin, SBRigoreau, LJSmith, JMSt-Gallay, SStock, JKTurnbull, APWheatley, ERWinter, JWingfield, J Structure-Based Design of Potent and Selective Inhibitors of the Metabolic Kinase PFKFB3. J Med Chem 58:3611-25 (2015)  
Target
Name:
6-phosphofructo-2-kinase/fructose-2,6-bisphosphatase 1
Synonyms:
6-phosphofructo-2-kinase 6PF-2-K/Fru-2,6-P2ase 1 F261_HUMAN F6PK PFK/FBPase 1 PFRX
Type:
PROTEIN
Mol. Mass.:
54681.17
Organism:
Homo sapiens (Human)
Description:
ChEMBL_109606
Residue:
471
  
Inhibitor
Name:
BDBM50082136
Synonyms:
CHEMBL3422659
Type:
Small organic molecule
Emp. Form.:
C21H22N6O3
Mol. Mass.:
406.4378
SMILES:
CN(C)C(=O)Cn1c(N)c(C#N)c2cc(Oc3ccc(NC(=O)CN)cc3)ccc12
: