Target
6-phosphofructo-2-kinase/fructose-2,6-bisphosphatase 2
Ligand
BDBM50082202
Substrate
Meas. Tech.
ChEMBL_1475279 (CHEMBL3425139)
IC50
>23700±n/a nM
Citation
 Boyd, SBrookfield, JLCritchlow, SECumming, IACurtis, NJDebreczeni, JDegorce, SLDonald, CEvans, NJGroombridge, SHopcroft, PJones, NPKettle, JGLamont, SLewis, HJMacFaull, PMcLoughlin, SBRigoreau, LJSmith, JMSt-Gallay, SStock, JKTurnbull, APWheatley, ERWinter, JWingfield, J Structure-Based Design of Potent and Selective Inhibitors of the Metabolic Kinase PFKFB3. J Med Chem 58:3611-25 (2015)  
Target
Name:
6-phosphofructo-2-kinase/fructose-2,6-bisphosphatase 2
Synonyms:
6-phosphofructo-2-kinase 6PF-2-K/Fru-2,6-P2ase 2 F262_HUMAN PFK/FBPase 2 | PFKFB2
Type:
PROTEIN
Mol. Mass.:
58485.20
Organism:
Homo sapiens (Human)
Description:
ChEMBL_109607
Residue:
505
  
Inhibitor
Name:
BDBM50082202
Synonyms:
CHEMBL3422669
Type:
Small organic molecule
Emp. Form.:
C23H22N4O3
Mol. Mass.:
402.4458
SMILES:
CCn1cc(C#N)c2cc(Oc3ccc(cc3)N(C)C(=O)[C@@H]3CCC(=O)N3)ccc12
: