Target
Farnesyl pyrophosphate synthase
Ligand
BDBM12576
Substrate
Meas. Tech.
ChEMBL_1478084 (CHEMBL3430146)
IC50
82±n/a nM
Citation
 Liu, YLCao, RWang, YOldfield, E Farnesyl diphosphate synthase inhibitors with unique ligand-binding geometries. ACS Med Chem Lett 6:349-54 (2015)  
Target
Name:
Farnesyl pyrophosphate synthase
Synonyms:
Dimethylallyltranstransferase FPP synthase FPPS_HUMAN Farnesyl diphosphate synthase Farnesyl diphosphate synthetase Farnesyl pyrophosphate synthetase KIAA1293 | P14324
Type:
Enzyme
Mol. Mass.:
48272.89
Organism:
Homo sapiens (Human)
Description:
P14324
Residue:
419
  
Inhibitor
Name:
BDBM12576
Synonyms:
Bisphosphonate 1 JMC515594 Compound 64 Risdronate [1-hydroxy-1-phosphono-2-(pyridin-3-yl)ethyl]phosphonic acid
Type:
Small organic molecule
Emp. Form.:
C7H11NO7P2
Mol. Mass.:
283.1123
SMILES:
OC(Cc1cccnc1)(P(O)(O)=O)P(O)(O)=O
: