Target
ADP-ribosyl cyclase/cyclic ADP-ribose hydrolase 1
Ligand
BDBM50086418
Substrate
Meas. Tech.
ChEMBL_1476004 (CHEMBL3428360)
IC50
19±n/a nM
Citation
 Haffner, CDBecherer, JDBoros, EECadilla, RCarpenter, TCowan, DDeaton, DNGuo, YHarrington, WHenke, BRJeune, MRKaldor, IMilliken, NPetrov, KGPreugschat, FSchulte, CShearer, BGShearer, TSmalley, TLStewart, ELStuart, JDUlrich, JC Discovery, Synthesis, and Biological Evaluation of Thiazoloquin(az)olin(on)es as Potent CD38 Inhibitors. J Med Chem 58:3548-71 (2015)  
Target
Name:
ADP-ribosyl cyclase/cyclic ADP-ribose hydrolase 1
Synonyms:
ADP-ribosyl cyclase 1 ADPRC 1 CD_antigen=CD38 Cyclic ADP-ribose hydrolase 1 NIM-R5 antigen | cADPr hydrolase 1
Type:
PROTEIN
Mol. Mass.:
34417.04
Organism:
Mus musculus
Description:
ChEMBL_109609
Residue:
304
  
Inhibitor
Name:
BDBM50086418
Synonyms:
CHEMBL3426072
Type:
Small organic molecule
Emp. Form.:
C17H11ClN4S
Mol. Mass.:
338.814
SMILES:
Clc1cccc(Nc2ncnc3ccc(cc23)-c2cncs2)c1
: